Target
Macrophage-stimulating protein receptor
Ligand
BDBM50147893
Substrate
Meas. Tech.
ChEMBL_1556111 (CHEMBL3768355)
IC50
15±n/a nM
Citation
 Zhai, XBao, GWang, LCheng, MZhao, MZhao, SZhou, HGong, P Design, synthesis and biological evaluation of novel 4-phenoxy-6,7-disubstituted quinolines possessing (thio)semicarbazones as c-Met kinase inhibitors. Bioorg Med Chem 24:1331-45 (2016)  
Target
Name:
Macrophage-stimulating protein receptor
Synonyms:
2.7.10.1 CDw136 MST1R Macrophage-stimulating protein receptor alpha chain PTK8 RON Tyrosine kinase receptor ron | p185-Ron
Type:
Protein
Mol. Mass.:
152270.76
Organism:
Homo sapiens (Human)
Description:
Q04912
Residue:
1400
  
Inhibitor
Name:
BDBM50147893
Synonyms:
CHEMBL3764279
Type:
Small organic molecule
Emp. Form.:
C35H38FN5O5
Mol. Mass.:
627.7051
SMILES:
COc1cc2c(Oc3ccc(NC(=O)N\N=C\c4cccc(CC=C)c4O)cc3F)ccnc2cc1OCCCN1CCCCC1
: