Target
Polyunsaturated fatty acid lipoxygenase ALOX15B
Ligand
BDBM56150
Substrate
Meas. Tech.
ChEMBL_1556335 (CHEMBL3766394)
IC50
>50000±n/a nM
Citation
 Armstrong, MMFreedman, CJJung, JEZheng, YKalyanaraman, CJacobson, MPSimeonov, AMaloney, DJvan Leyen, KJadhav, AHolman, TR A potent and selective inhibitor targeting human and murine 12/15-LOX. Bioorg Med Chem 24:1183-90 (2016)  
Target
Name:
Polyunsaturated fatty acid lipoxygenase ALOX15B
Synonyms:
15-LOX-2 15-Lipoxygenase-2 (15-LOX-2) ALOX15B Arachidonate 15-lipoxygenase, type II Epithelial 15-lipoxygenase-2 | LX15B_HUMAN
Type:
Protein
Mol. Mass.:
75850.40
Organism:
Homo sapiens (Human)
Description:
Residue:
676
  
Inhibitor
Name:
BDBM56150
Synonyms:
(6E)-4-methyl-6-[5-(2-methylphenyl)-1,2-dihydropyrazol-3-ylidene]-1-cyclohexa-2,4-dienone (6E)-4-methyl-6-[5-(o-tolyl)-3-pyrazolin-3-ylidene]cyclohexa-2,4-dien-1-one MLS000099089 cid_5405417
Type:
Small organic molecule
Emp. Form.:
C17H16N2O
Mol. Mass.:
264.3217
SMILES:
Cc1ccc(O)c(c1)-c1cc([nH]n1)-c1ccccc1C
: