Target
Phosphodiesterase
Ligand
BDBM50148237
Substrate
Meas. Tech.
ChEMBL_1553554 (CHEMBL3769086)
IC50
10.0±n/a nM
Citation
 Veerman, Jvan den Bergh, TOrrling, KMJansen, CCos, PMaes, LChatelain, EIoset, JREdink, EETenor, HSeebeck, Tde Esch, ILeurs, RSterk, GJ Synthesis and evaluation of analogs of the phenylpyridazinone NPD-001 as potent trypanosomal TbrPDEB1 phosphodiesterase inhibitors and in vitro trypanocidals. Bioorg Med Chem 24:1573-81 (2016)  
Target
Name:
Phosphodiesterase
Synonyms:
Class 1 phosphodiesterase PDEB1 PDEB1
Type:
Protein
Mol. Mass.:
103683.20
Organism:
Trypanosoma brucei
Description:
Residue:
930
  
Inhibitor
Name:
BDBM50148237
Synonyms:
CHEMBL3763233
Type:
Small organic molecule
Emp. Form.:
C34H42N6O4
Mol. Mass.:
598.7351
SMILES:
[H][C@@]12CC=CC[C@]1([H])C(=NN(C1CCCCCC1)C2=O)c1ccc(OC)c(OCCCCOc2ccc(cc2)-c2nnnn2C)c1
: