Target
Kappa-type opioid receptor
Ligand
BDBM50148259
Substrate
Meas. Tech.
ChEMBL_1553737 (CHEMBL3766805)
EC50
813±n/a nM
Citation
 Adamska, AKluczyk, ACerlesi, MCCalo, GJanecka, ABorics, A Synthesis, biological evaluation and structural analysis of novel peripherally active morphiceptin analogs. Bioorg Med Chem 24:1582-8 (2016)  
Target
Name:
Kappa-type opioid receptor
Synonyms:
K-OR-1 Kappa-opioid receptor (KOR) Kappa-type opioid receptor (KOR) OPIATE Kappa OPRK1 kappa opioid receptor (KOR)
Type:
G Protein-Coupled Receptor (GPCR)
Mol. Mass.:
42648.76
Organism:
Homo sapiens (Human)
Description:
P41145
Residue:
380
  
Inhibitor
Name:
BDBM50148259
Synonyms:
CHEMBL3765406
Type:
Small organic molecule
Emp. Form.:
C28H31F4N5O5
Mol. Mass.:
593.5699
SMILES:
N[C@@H](Cc1ccc(O)cc1)C(=O)N1CC(F)(F)C[C@H]1C(=O)N[C@@H](Cc1ccccc1)C(=O)N1CC(F)(F)C[C@@H]1C(N)=O
: