Target
Glycylpeptide N-tetradecanoyltransferase 1
Ligand
BDBM50135702
Substrate
Meas. Tech.
ChEMBL_1556710 (CHEMBL3773953)
Ki
860±n/a nM
Citation
 Rackham, MDYu, ZBrannigan, JAHeal, WPPaape, DBarker, KVWilkinson, AJSmith, DFLeatherbarrow, RJTate, EW Discovery of high affinity inhibitors of Leishmania donovani N-myristoyltransferase. Medchemcomm 6:1761-1766 (2016)  
Target
Name:
Glycylpeptide N-tetradecanoyltransferase 1
Synonyms:
Myristoyl-CoA:protein N-myristoyltransferase (Nmt) NMT NMT1_HUMAN Peptide N-myristoyltransferase 1
Type:
Enzyme
Mol. Mass.:
56814.10
Organism:
Homo sapiens (Human)
Description:
P30419
Residue:
496
  
Inhibitor
Name:
BDBM50135702
Synonyms:
CHEMBL3753483
Type:
Small organic molecule
Emp. Form.:
C22H25N3O4
Mol. Mass.:
395.4516
SMILES:
COc1cccc(Cc2noc(n2)-c2ccc(OC)cc2OC2CCNCC2)c1
: