Target
Bromodomain adjacent to zinc finger domain protein 2A
Ligand
BDBM50148275
Substrate
Meas. Tech.
ChEMBL_1557666 (CHEMBL3772735)
IC50
3300±n/a nM
Citation
 Chen, PChaikuad, ABamborough, PBantscheff, MBountra, CChung, CWFedorov, OGrandi, PJung, DLesniak, RLindon, MMüller, SPhilpott, MPrinjha, RRogers, CSelenski, CTallant, CWerner, TWillson, TMKnapp, SDrewry, DH Discovery and Characterization of GSK2801, a Selective Chemical Probe for the Bromodomains BAZ2A and BAZ2B. J Med Chem 59:1410-24 (2016)  
Target
Name:
Bromodomain adjacent to zinc finger domain protein 2A
Synonyms:
BAZ2A Bromodomain adjacent to zinc finger domain protein 2A KIAA0314 TTF-I-interacting protein 5 hWALp3
Type:
PROTEIN
Mol. Mass.:
211197.21
Organism:
Homo sapiens (Human)
Description:
ChEMBL_108002
Residue:
1905
  
Inhibitor
Name:
BDBM50148275
Synonyms:
CHEMBL3769769
Type:
Small organic molecule
Emp. Form.:
C16H13NO2
Mol. Mass.:
251.2799
SMILES:
CC(=O)c1cc(-c2cccc(O)c2)c2ccccn12
: