Target
Bromodomain-containing protein 4
Ligand
BDBM50148281
Substrate
Meas. Tech.
ChEMBL_1557668 (CHEMBL3772737)
IC50
>50000±n/a nM
Citation
 Chen, PChaikuad, ABamborough, PBantscheff, MBountra, CChung, CWFedorov, OGrandi, PJung, DLesniak, RLindon, MMüller, SPhilpott, MPrinjha, RRogers, CSelenski, CTallant, CWerner, TWillson, TMKnapp, SDrewry, DH Discovery and Characterization of GSK2801, a Selective Chemical Probe for the Bromodomains BAZ2A and BAZ2B. J Med Chem 59:1410-24 (2016)  
Target
Name:
Bromodomain-containing protein 4
Synonyms:
BRD4 Bromodomain-containing protein 4 (BRD4) Protein HUNK1
Type:
Protein
Mol. Mass.:
152264.84
Organism:
Homo sapiens (Human)
Description:
O60885
Residue:
1362
  
Inhibitor
Name:
BDBM50148281
Synonyms:
CHEMBL3770847
Type:
Small organic molecule
Emp. Form.:
C17H15NO3S
Mol. Mass.:
313.371
SMILES:
CC(=O)c1cc(-c2ccccc2S(C)(=O)=O)c2ccccn12
: