Target
Bromodomain-containing protein 9
Ligand
BDBM50148270
Substrate
Meas. Tech.
ChEMBL_1557664 (CHEMBL3772733)
Kd
1200±n/a nM
Citation
 Chen, PChaikuad, ABamborough, PBantscheff, MBountra, CChung, CWFedorov, OGrandi, PJung, DLesniak, RLindon, MMüller, SPhilpott, MPrinjha, RRogers, CSelenski, CTallant, CWerner, TWillson, TMKnapp, SDrewry, DH Discovery and Characterization of GSK2801, a Selective Chemical Probe for the Bromodomains BAZ2A and BAZ2B. J Med Chem 59:1410-24 (2016)  
Target
Name:
Bromodomain-containing protein 9
Synonyms:
BRD9 Bromodomain-containing protein 9 | Rhabdomyosarcoma antigen MU-RMS-40.8
Type:
PROTEIN
Mol. Mass.:
66994.30
Organism:
Homo sapiens (Human)
Description:
ChEMBL_108000
Residue:
597
  
Inhibitor
Name:
BDBM50148270
Synonyms:
CHEMBL3739699
Type:
Small organic molecule
Emp. Form.:
C20H21NO4S
Mol. Mass.:
371.45
SMILES:
CCCOc1ccn2c(cc(-c3ccccc3S(C)(=O)=O)c2c1)C(C)=O
: