Target
CREB-binding protein
Ligand
BDBM50148552
Substrate
Meas. Tech.
ChEMBL_1558072 (CHEMBL3771647)
Kd
2000±n/a nM
Citation
 Unzue, AXu, MDong, JWiedmer, LSpiliotopoulos, DCaflisch, ANevado, C Fragment-Based Design of Selective Nanomolar Ligands of the CREBBP Bromodomain. J Med Chem 59:1350-6 (2016)  
Target
Name:
CREB-binding protein
Synonyms:
CBP CREB-binding protein (CBP) CREBBP
Type:
Transcription Coactivator
Mol. Mass.:
265411.66
Organism:
Homo sapiens (Human)
Description:
Q92793
Residue:
2442
  
Inhibitor
Name:
BDBM50148552
Synonyms:
CHEMBL3770150
Type:
Small organic molecule
Emp. Form.:
C18H17NO5
Mol. Mass.:
327.3313
SMILES:
CCOc1ccc(cc1NC(=O)c1cccc(c1)C(O)=O)C(C)=O
: