Target
CREB-binding protein
Ligand
BDBM50148555
Substrate
Meas. Tech.
ChEMBL_1558072 (CHEMBL3771647)
Kd
800±n/a nM
Citation
 Unzue, AXu, MDong, JWiedmer, LSpiliotopoulos, DCaflisch, ANevado, C Fragment-Based Design of Selective Nanomolar Ligands of the CREBBP Bromodomain. J Med Chem 59:1350-6 (2016)  
Target
Name:
CREB-binding protein
Synonyms:
CBP CREB-binding protein (CBP) CREBBP
Type:
Transcription Coactivator
Mol. Mass.:
265411.66
Organism:
Homo sapiens (Human)
Description:
Q92793
Residue:
2442
  
Inhibitor
Name:
BDBM50148555
Synonyms:
CHEMBL3771341
Type:
Small organic molecule
Emp. Form.:
C20H21NO6
Mol. Mass.:
371.3838
SMILES:
CCOc1ccc(cc1NC(=O)c1cc(COC)cc(c1)C(O)=O)C(C)=O
: