Target
Orexin/Hypocretin receptor type 1
Ligand
BDBM50318701
Substrate
Meas. Tech.
ChEMBL_1558154 (CHEMBL3771998)
IC50
50±n/a nM
Citation
 Roecker, AJCox, CDColeman, PJ Orexin Receptor Antagonists: New Therapeutic Agents for the Treatment of Insomnia. J Med Chem 59:504-30 (2016)  
Target
Name:
Orexin/Hypocretin receptor type 1
Synonyms:
HCRTR1 OX1R_HUMAN Orexin receptor type 1 (OR 1) Orexin receptor type 1 (OX1) Orexin receptor type 1 (OxR1) | Ox1r
Type:
Protein
Mol. Mass.:
47554.50
Organism:
Homo sapiens (Human)
Description:
O43613
Residue:
425
  
Inhibitor
Name:
BDBM50318701
Synonyms:
CHEMBL1083659 [(7R)-4-(5-Chloro-1,3-benzoxazol-2-yl)-7-methyl-1,4-diazepan-1-yl][5-methyl-2-(2H-1,2,3-triazol-2-yl)phenyl]methanone
Type:
Small organic molecule
Emp. Form.:
C23H23ClN6O2
Mol. Mass.:
450.921
SMILES:
C[C@@H]1CCN(CCN1C(=O)c1cc(C)ccc1-n1nccn1)c1nc2cc(Cl)ccc2o1
: