Target
Bromodomain-containing protein 2
Ligand
BDBM50148605
Substrate
Meas. Tech.
ChEMBL_1556385 (CHEMBL3772116)
Kd
1470±n/a nM
Citation
 Baud, MGLin-Shiao, EZengerle, MTallant, CCiulli, A New Synthetic Routes to Triazolo-benzodiazepine Analogues: Expanding the Scope of the Bump-and-Hole Approach for Selective Bromo and Extra-Terminal (BET) Bromodomain Inhibition. J Med Chem 59:1492-500 (2016)  
Target
Name:
Bromodomain-containing protein 2
Synonyms:
BRD2 Bromodomain and extra-terminal motif (BET) Bromodomain-containing protein 2 (BRD2) RING3
Type:
Protein
Mol. Mass.:
88085.95
Organism:
Homo sapiens (Human)
Description:
P25440
Residue:
801
  
Inhibitor
Name:
BDBM50148605
Synonyms:
CHEMBL3769729
Type:
Small organic molecule
Emp. Form.:
C22H21ClN4O3
Mol. Mass.:
424.88
SMILES:
[H][C@]1(N=C(c2ccc(Cl)cc2)c2cc(OC)ccc2-n2c(C)nnc12)[C@@H](C)C(=O)OC
: