Target
Calmodulin-domain protein kinase 1
Ligand
BDBM50148653
Substrate
Meas. Tech.
ChEMBL_1557115 (CHEMBL3773067)
IC50
17±n/a nM
Citation
 Huang, WOjo, KKZhang, ZRivas, KVidadala, RSScheele, SDeRocher, AEChoi, RHulverson, MABarrett, LKBruzual, ISiddaramaiah, LKKerchner, KMKurnick, MDFreiberg, GMKempf, DHol, WGMerritt, EANeckermann, Gde Hostos, ELIsoherranen, NMaly, DJParsons, MDoggett, JSVan Voorhis, WCFan, E SAR Studies of 5-Aminopyrazole-4-carboxamide Analogues as Potent and Selective Inhibitors of Toxoplasma gondii CDPK1. ACS Med Chem Lett 6:1184-1189 (2015)  
Target
Name:
Calmodulin-domain protein kinase 1
Synonyms:
Calmodulin-domain protein kinase 1 Calmodulin-domain protein kinase, putative
Type:
Enzyme Catalytic Domain
Mol. Mass.:
57248.42
Organism:
Toxoplasma gondii
Description:
Residue:
507
  
Inhibitor
Name:
BDBM50148653
Synonyms:
CHEMBL3771104 US9956214, Compound 1632
Type:
Small organic molecule
Emp. Form.:
C22H27N5O2
Mol. Mass.:
393.4821
SMILES:
CCOc1ccc2cc(ccc2n1)-c1nn(C2CCCCCC2)c(N)c1C(N)=O
: