Target
NAD-dependent protein deacetylase sirtuin-2
Ligand
BDBM50148829
Substrate
Meas. Tech.
ChEMBL_1557233 (CHEMBL3773608)
IC50
1.000000±n/a nM
Citation
 Schiedel, MRumpf, TKaraman, BLehotzky, AOláh, JGerhardt, SOvádi, JSippl, WEinsle, OJung, M Aminothiazoles as Potent and Selective Sirt2 Inhibitors: A Structure-Activity Relationship Study. J Med Chem 59:1599-612 (2016)  
Target
Name:
NAD-dependent protein deacetylase sirtuin-2
Synonyms:
NAD-Dependent Deacetylase Sirtuin-2 NAD-dependent deacetylase sirtuin 3 SIR2-like SIR2L SIR2_HUMAN Sirtuin 2 (SIRT2)
Type:
Hydrolase
Mol. Mass.:
43172.62
Organism:
Homo sapiens (Human)
Description:
Residue:
389
  
Inhibitor
Name:
BDBM50148829
Synonyms:
CHEMBL3769432
Type:
Small organic molecule
Emp. Form.:
C90H122F3N27O23S
Mol. Mass.:
2039.159
SMILES:
[H][C@]1(NC(=O)[C@H](CCCNC(N)=N)NC(=O)[C@H](CCCNC(N)=N)NC(=O)[C@H](CCCCNC(=O)C(F)(F)F)NC(=O)[C@@H](NC(=O)[C@H](Cc2c[nH]cn2)NC(=O)[C@H](Cc2ccc(O)cc2)NC(=O)[C@@]([H])(NC(=O)[C@H](Cc2c[nH]cn2)NC(=O)[C@H](Cc2ccc(O)cc2)NC(=O)CSC[C@H](NC(=O)[C@H](Cc2ccc(O)cc2)NC(=O)[C@H](Cc2ccc(O)cc2)NC(=O)[C@H](CC(N)=O)NC1=O)C(N)=O)[C@@H](C)O)C(C)C)[C@@H](C)O
: