Target
5-hydroxytryptamine receptor 2B
Ligand
BDBM50403163
Substrate
Meas. Tech.
ChEMBL_1557255 (CHEMBL3773630)
EC50
1.29±n/a nM
Citation
 Cheng, JGiguere, PMSchmerberg, CMPogorelov, VMRodriguiz, RMHuang, XPZhu, HMcCorvy, JDWetsel, WCRoth, BLKozikowski, AP Further Advances in Optimizing (2-Phenylcyclopropyl)methylamines as Novel Serotonin 2C Agonists: Effects on Hyperlocomotion, Prepulse Inhibition, and Cognition Models. J Med Chem 59:578-91 (2016)  
Target
Name:
5-hydroxytryptamine receptor 2B
Synonyms:
5-HT-2B 5-hydroxytryptamine (serotonin) receptor 2B [Homo sapiens] 5-hydroxytryptamine receptor 2C (5HT2C) HTR2B Serotonin 2b (5-HT2b) receptor | Serotonin Receptor 2B
Type:
G Protein-Coupled Receptor (GPCR)
Mol. Mass.:
54312.47
Organism:
Homo sapiens (Human)
Description:
Receptor binding assays were performed using human clone stably expressed in CHO cells.
Residue:
481
  
Inhibitor
Name:
BDBM50403163
Synonyms:
OXITRIPTAN
Type:
Small organic molecule
Emp. Form.:
C11H12N2O3
Mol. Mass.:
220.2246
SMILES:
N[C@@H](Cc1c[nH]c2ccc(O)cc12)C(O)=O
: