Target
5-hydroxytryptamine receptor 2A
Ligand
BDBM50148846
Substrate
Meas. Tech.
ChEMBL_1557257 (CHEMBL3773632)
EC50
203±n/a nM
Citation
 Cheng, JGiguere, PMSchmerberg, CMPogorelov, VMRodriguiz, RMHuang, XPZhu, HMcCorvy, JDWetsel, WCRoth, BLKozikowski, AP Further Advances in Optimizing (2-Phenylcyclopropyl)methylamines as Novel Serotonin 2C Agonists: Effects on Hyperlocomotion, Prepulse Inhibition, and Cognition Models. J Med Chem 59:578-91 (2016)  
Target
Name:
5-hydroxytryptamine receptor 2A
Synonyms:
5-HT-2 5-HT2A 5-hydroxytryptamine receptor 2A (5HT-2A) 5HT2A_HUMAN HTR2A | Serotonin receptor 2A
Type:
undefined
Mol. Mass.:
52607.65
Organism:
Homo sapiens (Human)
Description:
P28223
Residue:
471
  
Inhibitor
Name:
BDBM50148846
Synonyms:
CHEMBL3769454
Type:
Small organic molecule
Emp. Form.:
C11H14Cl3NO
Mol. Mass.:
282.594
SMILES:
Cl.COc1ccc(Cl)c(Cl)c1C1CC1CN
: