Target
Sodium-dependent serotonin transporter
Ligand
BDBM50148852
Substrate
Meas. Tech.
ChEMBL_1557332 (CHEMBL3774016)
Ki
1259±n/a nM
Citation
 Cheng, JGiguere, PMSchmerberg, CMPogorelov, VMRodriguiz, RMHuang, XPZhu, HMcCorvy, JDWetsel, WCRoth, BLKozikowski, AP Further Advances in Optimizing (2-Phenylcyclopropyl)methylamines as Novel Serotonin 2C Agonists: Effects on Hyperlocomotion, Prepulse Inhibition, and Cognition Models. J Med Chem 59:578-91 (2016)  
Target
Name:
Sodium-dependent serotonin transporter
Synonyms:
5-HT Transporter 5HTT SC6A4_HUMAN SLC6A4 Serotonin transporter (5HTT) Sodium-dependent serotonin transporter (SERT) | Solute carrier family 6 member 4
Type:
Multi-pass membrane protein
Mol. Mass.:
70322.51
Organism:
Homo sapiens (Human)
Description:
P31645
Residue:
630
  
Inhibitor
Name:
BDBM50148852
Synonyms:
CHEMBL3769968
Type:
Small organic molecule
Emp. Form.:
C13H16ClF2NO
Mol. Mass.:
275.722
SMILES:
Cl.NCC1CC1c1cc(F)c(F)cc1OCC=C
: