Target
D(3) dopamine receptor
Ligand
BDBM50148852
Substrate
Meas. Tech.
ChEMBL_1557333 (CHEMBL3774017)
Ki
195±n/a nM
Citation
 Cheng, JGiguere, PMSchmerberg, CMPogorelov, VMRodriguiz, RMHuang, XPZhu, HMcCorvy, JDWetsel, WCRoth, BLKozikowski, AP Further Advances in Optimizing (2-Phenylcyclopropyl)methylamines as Novel Serotonin 2C Agonists: Effects on Hyperlocomotion, Prepulse Inhibition, and Cognition Models. J Med Chem 59:578-91 (2016)  
Target
Name:
D(3) dopamine receptor
Synonyms:
DOPAMINE D3 DRD3_HUMAN Dopamine D3 receptor (D3) Dopamine receptor Dopamine receptor D3
Type:
Mol. Mass.:
44243.43
Organism:
Homo sapiens (Human)
Description:
Residue:
400
  
Inhibitor
Name:
BDBM50148852
Synonyms:
CHEMBL3769968
Type:
Small organic molecule
Emp. Form.:
C13H16ClF2NO
Mol. Mass.:
275.722
SMILES:
Cl.NCC1CC1c1cc(F)c(F)cc1OCC=C
: