Target
Glycogen phosphorylase, muscle form
Ligand
BDBM50295859
Substrate
Meas. Tech.
ChEMBL_1557476 (CHEMBL3771807)
Ki
9000±n/a nM
Citation
 Bokor, ÉKun, SDocsa, TGergely, PSomsák, L 4(5)-Aryl-2-C-glucopyranosyl-imidazoles as New Nanomolar Glucose Analogue Inhibitors of Glycogen Phosphorylase. ACS Med Chem Lett 6:1215-9 (2015)  
Target
Name:
Glycogen phosphorylase, muscle form
Synonyms:
Glycogen Phosphorylase (PYGM) Glycogen phosphorylase, muscle form PYGM | PYGM_RABIT
Type:
Enzyme
Mol. Mass.:
97296.32
Organism:
Oryctolagus cuniculus (rabbit)
Description:
Phosphorylation of Ser-15 converts phosphorylase B (unphosphorylated) to phosphorylase A.
Residue:
843
  
Inhibitor
Name:
BDBM50295859
Synonyms:
(2S,3R,4R,5S,6R)-2-(1H-benzo[d]imidazol-2-yl)-6-(hydroxymethyl)tetrahydro-2H-pyran-3,4,5-triol | CHEMBL558445
Type:
Small organic molecule
Emp. Form.:
C13H16N2O5
Mol. Mass.:
280.2765
SMILES:
OC[C@H]1O[C@H]([C@H](O)[C@@H](O)[C@@H]1O)c1nc2ccccc2[nH]1
: