Target
Alkaline phosphatase, placental type
Ligand
BDBM50150089
Substrate
Meas. Tech.
ChEMBL_1559916 (CHEMBL3776734)
pH
10.4±n/a
IC50
>400000±n/a nM
Comments
extracted
Citation
 Marquès, SBuchet, RPopowycz, FLemaire, MMebarek, S Synthesis of benzofuran derivatives as selective inhibitors of tissue-nonspecific alkaline phosphatase: effects on cell toxicity and osteoblast-induced mineralization. Bioorg Med Chem Lett 26:1457-9 (2016)  
Target
Name:
Alkaline phosphatase, placental type
Synonyms:
ALPP PLAP | PPB1_HUMAN
Type:
PROTEIN
Mol. Mass.:
57950.65
Organism:
Homo sapiens (Human)
Description:
ChEMBL_1506090
Residue:
535
  
Inhibitor
Name:
BDBM50150089
Synonyms:
CHEMBL3774723
Type:
Small organic molecule
Emp. Form.:
C13H10N2O2S
Mol. Mass.:
258.296
SMILES:
N=c1sccn1CC(=O)c1cc2ccccc2o1
: