Target
Melanin-concentrating hormone receptor 1
Ligand
BDBM50149447
Substrate
Meas. Tech.
ChEMBL_1557964 (CHEMBL3774040)
IC50
30±n/a nM
Citation
 Igawa, HTakahashi, MKakegawa, KKina, AIkoma, MAida, JYasuma, TKawata, YAshina, SYamamoto, SKundu, MKhamrai, UHirabayashi, HNakayama, MNagisa, YKasai, SMaekawa, T Melanin-Concentrating Hormone Receptor 1 Antagonists Lacking an Aliphatic Amine: Synthesis and Structure-Activity Relationships of Novel 1-(Imidazo[1,2-a]pyridin-6-yl)pyridin-2(1H)-one Derivatives. J Med Chem 59:1116-39 (2016)  
Target
Name:
Melanin-concentrating hormone receptor 1
Synonyms:
G-protein coupled receptor 24 MCH receptor 1 MCH-R1 MCHR MCHR1_RAT Melanin Concentrating Hormone 1 Melanin-concentrating hormone receptor 1 Slc1 | Somatostatin receptor-like protein
Type:
Enzyme Catalytic Domain
Mol. Mass.:
39075.64
Organism:
RAT
Description:
Melanin Concentrating Hormone 1 GPR24 RAT::P97639
Residue:
353
  
Inhibitor
Name:
BDBM50149447
Synonyms:
CHEMBL3769550
Type:
Small organic molecule
Emp. Form.:
C22H19ClN4O2
Mol. Mass.:
406.865
SMILES:
Cc1c(nc2ccc(cn12)-n1ccc(OCc2ccc(Cl)cc2)nc1=O)C1CC1
: