Target
Melanin-concentrating hormone receptor 1
Ligand
BDBM50149462
Substrate
Meas. Tech.
ChEMBL_1557967 (CHEMBL3774043)
IC50
19±n/a nM
Citation
 Igawa, HTakahashi, MKakegawa, KKina, AIkoma, MAida, JYasuma, TKawata, YAshina, SYamamoto, SKundu, MKhamrai, UHirabayashi, HNakayama, MNagisa, YKasai, SMaekawa, T Melanin-Concentrating Hormone Receptor 1 Antagonists Lacking an Aliphatic Amine: Synthesis and Structure-Activity Relationships of Novel 1-(Imidazo[1,2-a]pyridin-6-yl)pyridin-2(1H)-one Derivatives. J Med Chem 59:1116-39 (2016)  
Target
Name:
Melanin-concentrating hormone receptor 1
Synonyms:
G-protein coupled receptor 24 MCH receptor 1 MCH-R1 MCHR-1 MCHR1_HUMAN Melanin-Concentrating Hormone Receptor 1 (MCH1R) Melanin-concentrating hormone receptor 1 (MCH-1) Melanin-concentrating hormone receptor 1 (MCHR-1) SLC-1 Somatostatin receptor-like protein
Type:
G Protein-Coupled Receptor (GPCR)
Mol. Mass.:
45976.27
Organism:
Homo sapiens (Human)
Description:
Membranes from CHO-K1 cells stably expressing human MCH1R were used in assays.
Residue:
422
  
Inhibitor
Name:
BDBM50149462
Synonyms:
CHEMBL3771182
Type:
Small organic molecule
Emp. Form.:
C21H18ClN3O2S
Mol. Mass.:
411.905
SMILES:
Cc1c(nc2ccc(cn12)-n1ccc(OCc2csc(Cl)c2)cc1=O)C1CC1
: