Target
Lysine-specific demethylase 4C
Ligand
BDBM50150022
Substrate
Meas. Tech.
ChEMBL_1558373 (CHEMBL3772965)
IC50
<100000±n/a nM
Citation
 Westaway, SMPreston, AGBarker, MDBrown, FBrown, JACampbell, MChung, CWDrewes, GEagle, RGarton, NGordon, LHaslam, CHayhow, TGHumphreys, PGJoberty, GKatso, RKruidenier, LLeveridge, MPemberton, MRioja, ISeal, GAShipley, TSingh, OSuckling, CJTaylor, JThomas, PWilson, DMLee, KPrinjha, RK Cell Penetrant Inhibitors of the KDM4 and KDM5 Families of Histone Lysine Demethylases. 2. Pyrido[3,4-d]pyrimidin-4(3H)-one Derivatives. J Med Chem 59:1370-87 (2016)  
Target
Name:
Lysine-specific demethylase 4C
Synonyms:
GASC-1 protein Gene amplified in squamous cell carcinoma 1 protein JMJD2C Jumonji domain-containing protein 2C KDM4C_HUMAN | KIAA0780
Type:
Protein
Mol. Mass.:
119979.01
Organism:
Homo sapiens (Human)
Description:
Q9H3R0
Residue:
1056
  
Inhibitor
Name:
BDBM50150022
Synonyms:
CHEMBL3769601
Type:
Small organic molecule
Emp. Form.:
C8H6N2O
Mol. Mass.:
146.146
SMILES:
O=c1[nH]ccc2cnccc12
: