Target
Amine oxidase [flavin-containing] B
Ligand
BDBM50149976
Substrate
Meas. Tech.
ChEMBL_1558469 (CHEMBL3773504)
IC50
45240±n/a nM
Citation
 Chen, RXiao, JNi, YXu, HFZheng, MTong, XZhang, TTLiao, CTang, WJ Novel tricyclic pyrazolo[1,5-d][1,4]benzoxazepin-5(6H)-one: Design, synthesis, model and use as hMAO-B inhibitors. Bioorg Med Chem 24:1741-8 (2016)  
Target
Name:
Amine oxidase [flavin-containing] B
Synonyms:
AOFB_HUMAN MAOB Monoamine oxidase type B (MAO B) Monoamine oxidase type B (MAOB)
Type:
Protein
Mol. Mass.:
58768.76
Organism:
Homo sapiens (Human)
Description:
P27338
Residue:
520
  
Inhibitor
Name:
BDBM50149976
Synonyms:
CHEMBL3770129
Type:
Small organic molecule
Emp. Form.:
C19H18N2O2
Mol. Mass.:
306.3584
SMILES:
CC1Oc2ccccc2C2CC(=NN2C1=O)c1ccc(C)cc1
: