Target
Glutaminase kidney isoform, mitochondrial
Ligand
BDBM50150062
Substrate
Meas. Tech.
ChEBML_1558520
IC50
30±n/a nM
Citation
 McDermott, LAIyer, PVernetti, LRimer, SSun, JBoby, MYang, TFioravanti, MO'Neill, JWang, LDrakes, DKatt, WHuang, QCerione, R Design and evaluation of novel glutaminase inhibitors. Bioorg Med Chem 24:1819-39 (2016)  
Target
Name:
Glutaminase kidney isoform, mitochondrial
Synonyms:
GLS GLSK_HUMAN K-glutaminase L-glutamine amidohydrolase
Type:
Protein
Mol. Mass.:
73471.89
Organism:
Homo sapiens (Human)
Description:
O94925
Residue:
669
  
Inhibitor
Name:
BDBM50150062
Synonyms:
CHEMBL3769896
Type:
Small organic molecule
Emp. Form.:
C22H26N8O2S2
Mol. Mass.:
498.624
SMILES:
O=C(CC1CC1)Nc1nnc(s1)N1CCC(CC1)Nc1nnc(NC(=O)Cc2ccccc2)s1
: