Target
dCTP pyrophosphatase 1
Ligand
BDBM50150046
Substrate
Meas. Tech.
ChEBML_1558383
IC50
185±n/a nM
Target
Name:
dCTP pyrophosphatase 1
Synonyms:
DCTP1_HUMAN Deoxycytidine-triphosphatase 1 dCTP pyrophosphatase 1 | dCTP pyrophosphatase 1 (DCTPP1)
Type:
Protein
Mol. Mass.:
18673.58
Organism:
Homo sapiens (Human)
Description:
Q9H773
Residue:
170
  
Inhibitor
Name:
BDBM50150046
Synonyms:
CHEMBL3770766
Type:
Small organic molecule
Emp. Form.:
C14H9Cl3N4O2
Mol. Mass.:
371.606
SMILES:
Cc1nc2c(c(Cl)c(Cl)cc2n1Cc1ccc(Cl)nc1)[N+]([O-])=O
: