Target
cGMP-inhibited 3',5'-cyclic phosphodiesterase 3B
Ligand
BDBM50150171
Substrate
Meas. Tech.
ChEMBL_1556446 (CHEMBL3772477)
Ki
1500±n/a nM
Citation
 Li, PZheng, HZhao, JZhang, LYao, WZhu, HBeard, JDIda, KLane, WSnell, GSogabe, SHeyser, CJSnyder, GLHendrick, JPVanover, KEDavis, REWennogle, LP Discovery of Potent and Selective Inhibitors of Phosphodiesterase 1 for the Treatment of Cognitive Impairment Associated with Neurodegenerative and Neuropsychiatric Diseases. J Med Chem 59:1149-64 (2016)  
Target
Name:
cGMP-inhibited 3',5'-cyclic phosphodiesterase 3B
Synonyms:
CGI-PDE B CGIPDE1 PDE3B Phosphodiesterase 3B Phosphodiesterase Type 3 (PDE3B) cGMP-inhibited 3,5-cyclic phosphodiesterase B
Type:
Enzyme
Mol. Mass.:
124318.95
Organism:
Homo sapiens (Human)
Description:
PDE3B was generated from the full-length recombinant human clone transfected into Sf9 cells.
Residue:
1112
  
Inhibitor
Name:
BDBM50150171
Synonyms:
CHEMBL3770470
Type:
Small organic molecule
Emp. Form.:
C30H28N6O
Mol. Mass.:
488.5829
SMILES:
[H][C@@]12CCC[C@]1([H])N1C(=N2)N(C)C(=O)c2c1nn(Cc1ccc(cc1)-c1ccccc1)c2Nc1ccccc1
: