Target
cAMP-specific 3',5'-cyclic phosphodiesterase 7B
Ligand
BDBM50150238
Substrate
Meas. Tech.
ChEMBL_1556449 (CHEMBL3772480)
Ki
6100±n/a nM
Citation
 Li, PZheng, HZhao, JZhang, LYao, WZhu, HBeard, JDIda, KLane, WSnell, GSogabe, SHeyser, CJSnyder, GLHendrick, JPVanover, KEDavis, REWennogle, LP Discovery of Potent and Selective Inhibitors of Phosphodiesterase 1 for the Treatment of Cognitive Impairment Associated with Neurodegenerative and Neuropsychiatric Diseases. J Med Chem 59:1149-64 (2016)  
Target
Name:
cAMP-specific 3',5'-cyclic phosphodiesterase 7B
Synonyms:
3',5'-cyclic phosphodiesterase PDE7B_HUMAN Phosphodiesterase 7B (PDE7B) | cAMP-specific 3',5'-cyclic phosphodiesterase 7B
Type:
Enzyme
Mol. Mass.:
51842.76
Organism:
Homo sapiens (Human)
Description:
Q9NP56
Residue:
450
  
Inhibitor
Name:
BDBM50150238
Synonyms:
CHEMBL3770107
Type:
Small organic molecule
Emp. Form.:
C24H22F3N7O
Mol. Mass.:
481.473
SMILES:
[H][C@@]12CCC[C@]1([H])N1C(=N2)N(C)C(=O)c2c(Nc3ccccc3)n(Cc3ccc(nc3)C(F)(F)F)nc12
: