Target
Calcitonin gene-related peptide 1
Ligand
BDBM50150394
Substrate
Meas. Tech.
ChEMBL_1558562 (CHEMBL3773899)
IC50
16±n/a nM
Citation
 Civiello, RLHan, XBeno, BRChaturvedula, PVHerbst, JJXu, CConway, CMMacor, JEDubowchik, GM Synthesis and SAR of calcitonin gene-related peptide (CGRP) antagonists containing substituted aryl-piperazines and piperidines. Bioorg Med Chem Lett 26:1229-32 (2016)  
Target
Name:
Calcitonin gene-related peptide 1
Synonyms:
CALC1 CALCA_HUMAN Calcitonin gene-related peptide (CGRP alpha) | Calcitonin gene-related peptide 1
Type:
Enzyme
Mol. Mass.:
13902.80
Organism:
Homo sapiens (Human)
Description:
P06881
Residue:
128
  
Inhibitor
Name:
BDBM50150394
Synonyms:
CHEMBL3770407
Type:
Small organic molecule
Emp. Form.:
C34H45ClN6O2
Mol. Mass.:
605.213
SMILES:
Cc1ccc(C2CCN(CC2)C(=O)N[C@H](Cc2cc(C)c3[nH]ncc3c2)C(=O)N2CCC(CC2)N2CCCCC2)c(Cl)c1
: