Target
Calcitonin gene-related peptide 1
Ligand
BDBM50150467
Substrate
Meas. Tech.
ChEMBL_1558562 (CHEMBL3773899)
IC50
24±n/a nM
Citation
 Civiello, RLHan, XBeno, BRChaturvedula, PVHerbst, JJXu, CConway, CMMacor, JEDubowchik, GM Synthesis and SAR of calcitonin gene-related peptide (CGRP) antagonists containing substituted aryl-piperazines and piperidines. Bioorg Med Chem Lett 26:1229-32 (2016)  
Target
Name:
Calcitonin gene-related peptide 1
Synonyms:
CALC1 CALCA_HUMAN Calcitonin gene-related peptide (CGRP alpha) | Calcitonin gene-related peptide 1
Type:
Enzyme
Mol. Mass.:
13902.80
Organism:
Homo sapiens (Human)
Description:
P06881
Residue:
128
  
Inhibitor
Name:
BDBM50150467
Synonyms:
CHEMBL3769892
Type:
Small organic molecule
Emp. Form.:
C35H42F6N6O2
Mol. Mass.:
692.7374
SMILES:
Cc1cc(C[C@@H](NC(=O)N2CCC(CC2)c2ccc(cc2C(F)(F)F)C(F)(F)F)C(=O)N2CCC(CC2)N2CCCCC2)cc2cn[nH]c12
: