Target
Presenilin-1
Ligand
BDBM50150507
Substrate
Meas. Tech.
ChEMBL_1558598 (CHEMBL3774087)
IC50
40±n/a nM
Citation
 Shi, JZuev, DXu, LLentz, KAGrace, JEToyn, JHOlson, REMacor, JEThompson, LA Design and optimization of tricyclic gamma-secretase modulators. Bioorg Med Chem Lett 26:1498-502 (2016)  
Target
Name:
Presenilin-1
Synonyms:
3.4.23.- Gamma-Secretase Subunit Presenilin-1 PS1 PSEN1 PSNL1 Presenilin-1 CTF12 Protein S182
Type:
Mol. Mass.:
52657.13
Organism:
Homo sapiens (Human)
Description:
P49768
Residue:
467
  
Inhibitor
Name:
BDBM50150507
Synonyms:
CHEMBL3771055
Type:
Small organic molecule
Emp. Form.:
C21H18ClN5
Mol. Mass.:
375.854
SMILES:
Clc1cn(cn1)-c1ccc2Nc3nn(Cc4ccccc4)cc3CCc2c1
: