Target
Presenilin-1
Ligand
BDBM50150519
Substrate
Meas. Tech.
ChEMBL_1558617 (CHEMBL3774270)
IC50
29±n/a nM
Citation
 Shi, JZuev, DXu, LLentz, KAGrace, JEToyn, JHOlson, REMacor, JEThompson, LA Design and optimization of tricyclic gamma-secretase modulators. Bioorg Med Chem Lett 26:1498-502 (2016)  
Target
Name:
Presenilin-1
Synonyms:
3.4.23.- Gamma-Secretase Subunit Presenilin-1 PS1 PSEN1 PSNL1 Presenilin-1 CTF12 Protein S182
Type:
Mol. Mass.:
52657.13
Organism:
Homo sapiens (Human)
Description:
P49768
Residue:
467
  
Inhibitor
Name:
BDBM50150519
Synonyms:
CHEMBL3769487
Type:
Small organic molecule
Emp. Form.:
C22H23N7O
Mol. Mass.:
401.4643
SMILES:
CNc1nc(Cc2ccccc2)nc(Nc2ccc(c(OC)c2)-n2cnc(C)c2)n1
: