Target
Lysine-specific demethylase 4A
Ligand
BDBM50152119
Substrate
Meas. Tech.
ChEMBL_1561969 (CHEMBL3778805)
IC50
300±n/a nM
Citation
 Bavetsias, VLanigan, RMRuda, GFAtrash, BMcLaughlin, MGTumber, AMok, NYLe Bihan, YVDempster, SBoxall, KJJeganathan, FHatch, SBSavitsky, PVelupillai, SKrojer, TEngland, KSSejberg, JThai, CDonovan, APal, AScozzafava, GBennett, JMKawamura, AJohansson, CSzykowska, AGileadi, CBurgess-Brown, NAvon Delft, FOppermann, UWalters, ZShipley, JRaynaud, FIWestaway, SMPrinjha, RKFedorov, OBurke, RSchofield, CJWestwood, IMBountra, CMüller, Svan Montfort, RLBrennan, PEBlagg, J 8-Substituted Pyrido[3,4-d]pyrimidin-4(3H)-one Derivatives As Potent, Cell Permeable, KDM4 (JMJD2) and KDM5 (JARID1) Histone Lysine Demethylase Inhibitors. J Med Chem 59:1388-409 (2016)  
Target
Name:
Lysine-specific demethylase 4A
Synonyms:
JHDM3A JMJD2A Jumonji domain-containing protein 2A KDM4A_HUMAN Lysine-specific demethylase 4A | Lysine-specific demethylase 4A (KDM4A)
Type:
Enzyme
Mol. Mass.:
120647.83
Organism:
Homo sapiens (Human)
Description:
O75164
Residue:
1064
  
Inhibitor
Name:
BDBM50152119
Synonyms:
CHEMBL3775362
Type:
Small organic molecule
Emp. Form.:
C12H11LiN2O3
Mol. Mass.:
238.168
SMILES:
[Li+].[O-]C(=O)c1ccnc(CNCc2ccco2)c1
: