Target
Lysine-specific demethylase 2A
Ligand
BDBM50153181
Substrate
Meas. Tech.
ChEMBL_1562165 (CHEMBL3776389)
IC50
1200±n/a nM
Citation
 Bavetsias, VLanigan, RMRuda, GFAtrash, BMcLaughlin, MGTumber, AMok, NYLe Bihan, YVDempster, SBoxall, KJJeganathan, FHatch, SBSavitsky, PVelupillai, SKrojer, TEngland, KSSejberg, JThai, CDonovan, APal, AScozzafava, GBennett, JMKawamura, AJohansson, CSzykowska, AGileadi, CBurgess-Brown, NAvon Delft, FOppermann, UWalters, ZShipley, JRaynaud, FIWestaway, SMPrinjha, RKFedorov, OBurke, RSchofield, CJWestwood, IMBountra, CMüller, Svan Montfort, RLBrennan, PEBlagg, J 8-Substituted Pyrido[3,4-d]pyrimidin-4(3H)-one Derivatives As Potent, Cell Permeable, KDM4 (JMJD2) and KDM5 (JARID1) Histone Lysine Demethylase Inhibitors. J Med Chem 59:1388-409 (2016)  
Target
Name:
Lysine-specific demethylase 2A
Synonyms:
AA1-1162 F-box and leucine-rich repeat protein 11 FBL7 Homo sapiens lysine demethylase 2A (KDM2A) KDM2A KIAA1004 Lysine-specific demethylase 2A (KDM2A) | NM_012308
Type:
Enzyme Catalytic Domain
Mol. Mass.:
132809.04
Organism:
Homo sapiens (Human)
Description:
Residue:
1162
  
Inhibitor
Name:
BDBM50153181
Synonyms:
CHEMBL3774692
Type:
Small organic molecule
Emp. Form.:
C9H7N3O2S
Mol. Mass.:
221.236
SMILES:
Nc1nc(cs1)-c1cc(ccn1)C(O)=O
: