Target
Lysine-specific demethylase 4B
Ligand
BDBM50153094
Substrate
Meas. Tech.
ChEMBL_1561970 (CHEMBL3778806)
IC50
55±n/a nM
Citation
 Bavetsias, VLanigan, RMRuda, GFAtrash, BMcLaughlin, MGTumber, AMok, NYLe Bihan, YVDempster, SBoxall, KJJeganathan, FHatch, SBSavitsky, PVelupillai, SKrojer, TEngland, KSSejberg, JThai, CDonovan, APal, AScozzafava, GBennett, JMKawamura, AJohansson, CSzykowska, AGileadi, CBurgess-Brown, NAvon Delft, FOppermann, UWalters, ZShipley, JRaynaud, FIWestaway, SMPrinjha, RKFedorov, OBurke, RSchofield, CJWestwood, IMBountra, CMüller, Svan Montfort, RLBrennan, PEBlagg, J 8-Substituted Pyrido[3,4-d]pyrimidin-4(3H)-one Derivatives As Potent, Cell Permeable, KDM4 (JMJD2) and KDM5 (JARID1) Histone Lysine Demethylase Inhibitors. J Med Chem 59:1388-409 (2016)  
Target
Name:
Lysine-specific demethylase 4B
Synonyms:
JHDM3B JmjC domain-containing histone demethylation protein 3B KDM4B KIAA0876
Type:
PROTEIN
Mol. Mass.:
121904.33
Organism:
Homo sapiens (Human)
Description:
ChEMBL_109446
Residue:
1096
  
Inhibitor
Name:
BDBM50153094
Synonyms:
CHEMBL3775277
Type:
Small organic molecule
Emp. Form.:
C22H23N7O
Mol. Mass.:
401.4643
SMILES:
O=c1[nH]cnc2c(nccc12)-n1cc(CCN2CCC(CC2)c2ccncc2)cn1
: