Target
Disintegrin and metalloproteinase domain-containing protein 10
Ligand
BDBM50151244
Substrate
Meas. Tech.
ChEMBL_1559070 (CHEMBL3773926)
IC50
10000±n/a nM
Citation
 Camodeca, CNuti, ETepshi, LBoero, STuccinardi, TStura, EAPoggi, AZocchi, MRRossello, A Discovery of a new selective inhibitor of A Disintegrin And Metalloprotease 10 (ADAM-10) able to reduce the shedding of NKG2D ligands in Hodgkin's lymphoma cell models. Eur J Med Chem 111:193-201 (2016)  
Target
Name:
Disintegrin and metalloproteinase domain-containing protein 10
Synonyms:
ADA10_HUMAN Disintegrin and metalloproteinase domain-containing protein 10 (ADAM10) MADM
Type:
Enzyme
Mol. Mass.:
84160.93
Organism:
Homo sapiens (Human)
Description:
O14672
Residue:
748
  
Inhibitor
Name:
BDBM50151244
Synonyms:
CHEMBL3770688
Type:
Small organic molecule
Emp. Form.:
C25H32N6O6S
Mol. Mass.:
544.623
SMILES:
Cc1cc(ccc1N1CCN(CC1)S(=O)(=O)N[C@H](CCCNC(=O)OCc1ccccc1)C(=O)NO)C#N
: