Target
5-hydroxytryptamine receptor 1A
Ligand
BDBM50151265
Substrate
Meas. Tech.
ChEMBL_1559080 (CHEMBL3773936)
Ki
50±n/a nM
Citation
 Franchini, SBattisti, UMPrandi, ATait, ABorsari, CCichero, EFossa, PCilia, APrezzavento, ORonsisvalle, SAricò, GParenti, CBrasili, L Scouting new sigma receptor ligands: Synthesis, pharmacological evaluation and molecular modeling of 1,3-dioxolane-based structures and derivatives. Eur J Med Chem 112:1-19 (2016)  
Target
Name:
5-hydroxytryptamine receptor 1A
Synonyms:
5-HT-1A 5-hydroxytryptamine receptor 1A (5-HT-1A) ADRB2RL1 Dopamine D2 receptor and serotonin 1a receptor HTR1A | Serotonin receptor 1A
Type:
Mol. Mass.:
46122.49
Organism:
Homo sapiens (Human)
Description:
Residue:
422
  
Inhibitor
Name:
BDBM50151265
Synonyms:
CHEMBL3769446
Type:
Small organic molecule
Emp. Form.:
C30H35NO
Mol. Mass.:
425.605
SMILES:
O[C@@H]1[C@@H](CN2CCC(Cc3ccccc3)CC2)CCC1(c1ccccc1)c1ccccc1
: