Target
Transcription intermediary factor 1-alpha
Ligand
BDBM50150758
Substrate
Meas. Tech.
ChEMBL_1560318 (CHEMBL3779310)
IC50
10.0±n/a nM
Citation
 Palmer, WSPoncet-Montange, GLiu, GPetrocchi, AReyna, NSubramanian, GTheroff, JYau, AKost-Alimova, MBardenhagen, JPLeo, EShepard, HETieu, TNShi, XZhan, YZhao, SBarton, MCDraetta, GToniatti, CJones, PGeck Do, MAndersen, JN Structure-Guided Design of IACS-9571, a Selective High-Affinity Dual TRIM24-BRPF1 Bromodomain Inhibitor. J Med Chem 59:1440-54 (2016)  
Target
Name:
Transcription intermediary factor 1-alpha
Synonyms:
6.3.2.- RING finger protein 82 RNF82 TIF1-alpha TIF1A_HUMAN Transcription intermediary factor 1-alpha | Tripartite motif-containing protein 24
Type:
PROTEIN
Mol. Mass.:
116839.55
Organism:
Homo sapiens (Human)
Description:
ChEMBL_107998
Residue:
1050
  
Inhibitor
Name:
BDBM50150758
Synonyms:
CHEMBL3775901
Type:
Small organic molecule
Emp. Form.:
C28H38N6O6S
Mol. Mass.:
586.703
SMILES:
CCCOc1cc(OCCCCCCN)cc(Oc2cc3n(C)c(=O)n(C)c3cc2NS(=O)(=O)c2cn(C)cn2)c1
: