Target
Amine oxidase [flavin-containing] A
Ligand
BDBM50236898
Substrate
Meas. Tech.
ChEMBL_1561057 (CHEMBL3776540)
IC50
4200±n/a nM
Citation
 Itoh, YAihara, KMellini, PTojo, TOta, YTsumoto, HSolomon, VRZhan, PSuzuki, MOgasawara, DShigenaga, AInokuma, TNakagawa, HMiyata, NMizukami, TOtaka, ASuzuki, T Identification of SNAIL1 Peptide-Based Irreversible Lysine-Specific Demethylase 1-Selective Inactivators. J Med Chem 59:1531-44 (2016)  
Target
Name:
Amine oxidase [flavin-containing] A
Synonyms:
AOFA_HUMAN MAO-A Monoamine oxidase Monoamine oxidase type A (MAO A) Monoamine oxidase type A (MAOA)
Type:
Protein
Mol. Mass.:
59689.53
Organism:
Homo sapiens (Human)
Description:
P21397
Residue:
527
  
Inhibitor
Name:
BDBM50236898
Synonyms:
(1S,2R)-(+)-2-phenylcyclopropylamine TRANYLCYPROMINE trans-2-phenylcyclopropanamine | trans-2-phenylcyclopropylamine
Type:
Small organic molecule
Emp. Form.:
C9H11N
Mol. Mass.:
133.1903
SMILES:
N[C@H]1C[C@@H]1c1ccccc1
: