Target
Histone acetyltransferase KAT5
Ligand
BDBM50151659
Substrate
Meas. Tech.
ChEMBL_1561474 (CHEMBL3779611)
IC50
149000±n/a nM
Citation
 Simon, RPRobaa, DAlhalabi, ZSippl, WJung, M KATching-Up on Small Molecule Modulators of Lysine Acetyltransferases. J Med Chem 59:1249-70 (2016)  
Target
Name:
Histone acetyltransferase KAT5
Synonyms:
HTATIP KAT5_HUMAN | TIP60
Type:
PROTEIN
Mol. Mass.:
58595.98
Organism:
Homo sapiens (Human)
Description:
ChEMBL_796787
Residue:
513
  
Inhibitor
Name:
BDBM50151659
Synonyms:
CHEMBL3775244
Type:
Small organic molecule
Emp. Form.:
C32H24N4O4S2
Mol. Mass.:
592.687
SMILES:
COc1ccc(cc1OC)C1CC(=NN1c1nc(cs1)-c1ccc(cc1)N1C(=O)c2ccccc2C1=O)c1cccs1
: