Target
Cannabinoid receptor 1
Ligand
BDBM50151913
Substrate
Meas. Tech.
ChEMBL_1561402 (CHEMBL3778962)
Ki
653±n/a nM
Citation
 Aghazadeh Tabrizi, MBaraldi, PGRuggiero, ESaponaro, GBaraldi, SPoli, GTuccinardi, TRavani, AVincenzi, FBorea, PAVarani, K Synthesis and structure activity relationship investigation of triazolo[1,5-a]pyrimidines as CB2 cannabinoid receptor inverse agonists. Eur J Med Chem 113:11-27 (2016)  
Target
Name:
Cannabinoid receptor 1
Synonyms:
CANN6 CB-R CNR CNR1_HUMAN Cannabinoid receptor Cannabinoid receptor 1 (brain)
Type:
G Protein-Coupled Receptor (GPCR)
Mol. Mass.:
52868.96
Organism:
Homo sapiens (Human)
Description:
P21554
Residue:
472
  
Inhibitor
Name:
BDBM50151913
Synonyms:
CHEMBL3774565
Type:
Small organic molecule
Emp. Form.:
C29H37N5O2
Mol. Mass.:
487.6364
SMILES:
CCCCCn1cc(C(=O)NC23CC4CC(C)(CC(C)(C4)C2)C3)c(=O)n2nc(nc12)-c1ccccc1
: