Target
Cholinesterase
Ligand
BDBM50299747
Substrate
Meas. Tech.
ChEMBL_1564757 (CHEMBL3784264)
IC50
16560±n/a nM
Citation
 Schwarz, SLoesche, ALucas, SDSommerwerk, SSerbian, ISiewert, BPianowski, ECsuk, R Converting maslinic acid into an effective inhibitor of acylcholinesterases. Eur J Med Chem 103:438-45 (2015)  
Target
Name:
Cholinesterase
Synonyms:
BCHE CHLE_HORSE | Cholinesterase
Type:
Enzyme
Mol. Mass.:
65643.35
Organism:
Equus caballus (Horse)
Description:
P81908
Residue:
574
  
Inhibitor
Name:
BDBM50299747
Synonyms:
2beta,3beta-Dihydroxyolean-12-en-28-oic Acid augustic acid
Type:
Small organic molecule
Emp. Form.:
C30H48O4
Mol. Mass.:
472.6997
SMILES:
CC1(C)CC[C@@]2(CC[C@]3(C)C(=CC[C@@H]4[C@@]5(C)C[C@H](O)[C@H](O)C(C)(C)[C@@H]5CC[C@@]34C)[C@@H]2C1)C(O)=O
: