Target
Bromodomain-containing protein 4
Ligand
BDBM50155874
Substrate
Meas. Tech.
ChEMBL_1565263 (CHEMBL3782657)
IC50
1040±n/a nM
Citation
 Xue, XZhang, YLiu, ZSong, MXing, YXiang, QWang, ZTu, ZZhou, YDing, KXu, Y Discovery of Benzo[cd]indol-2(1H)-ones as Potent and Specific BET Bromodomain Inhibitors: Structure-Based Virtual Screening, Optimization, and Biological Evaluation. J Med Chem 59:1565-79 (2016)  
Target
Name:
Bromodomain-containing protein 4
Synonyms:
BRD4 Bromodomain-containing protein 4 (BRD4) Protein HUNK1
Type:
Protein
Mol. Mass.:
152264.84
Organism:
Homo sapiens (Human)
Description:
O60885
Residue:
1362
  
Inhibitor
Name:
BDBM50155874
Synonyms:
CHEMBL3780508
Type:
Small organic molecule
Emp. Form.:
C20H16N2O5S
Mol. Mass.:
396.416
SMILES:
CCN1C(=O)c2cccc3c(ccc1c23)S(=O)(=O)Nc1ccccc1C(O)=O
: