Target
Cannabinoid receptor 2
Ligand
BDBM50152102
Substrate
Meas. Tech.
ChEMBL_1565146 (CHEMBL3782504)
Ki
69±n/a nM
Citation
 Deiana, VGómez-Cañas, MPazos, MRFernández-Ruiz, JAsproni, BCichero, EFossa, PMuñoz, EDeligia, FMurineddu, GGarcía-Arencibia, MPinna, GA Tricyclic pyrazoles. Part 8. Synthesis, biological evaluation and modelling of tricyclic pyrazole carboxamides as potential CB2 receptor ligands with antagonist/inverse agonist properties. Eur J Med Chem 112:66-80 (2016)  
Target
Name:
Cannabinoid receptor 2
Synonyms:
CANNABINOID CB2 CB2 CB2B CNR2_HUMAN Cannabinoid CB2 receptor Cannabinoid receptor 2 (CB2R) | hCB2
Type:
G Protein-Coupled Receptor (GPCR)
Mol. Mass.:
39690.94
Organism:
Homo sapiens (Human)
Description:
P34972
Residue:
360
  
Inhibitor
Name:
BDBM50152102
Synonyms:
CHEMBL3781781
Type:
Small organic molecule
Emp. Form.:
C25H24Cl2N4O
Mol. Mass.:
467.39
SMILES:
Clc1ccc(c(Cl)c1)-n1nc(C(=O)NN2CCCCC2)c2Cc3cc(ccc3-c12)C1CC1
: