Target
Carbonic anhydrase 1
Ligand
BDBM10871
Substrate
Meas. Tech.
ChEMBL_1563412 (CHEMBL3782909)
Ki
23000±n/a nM
Citation
 Eminoglu, AVullo, DAsik, AÇolak, DNÇanakçi, SBeldüz, AOSupuran, CT Sulfonamide inhibition studies of theß-carbonic anhydrase from the newly discovered bacterium Enterobacter sp. B13. Bioorg Med Chem Lett 26:1821-6 (2016)  
Target
Name:
Carbonic anhydrase 1
Synonyms:
CA-I CAB Carbonate dehydratase I Carbonic anhydrase 1 (CA I) Carbonic anhydrase 1 (Recombinant CA I) Carbonic anhydrase B Carbonic anhydrase I (CA I) Carbonic anhydrase I (CAI) Carbonic anhydrase isoenzyme I (hCA I) | hCA
Type:
Enzyme
Mol. Mass.:
28873.37
Organism:
Homo sapiens (Human)
Description:
P00915
Residue:
261
  
Inhibitor
Name:
BDBM10871
Synonyms:
4-amino-N-[(4-sulfamoylphenyl)methyl]benzene-1-sulfonamide aromatic/heteroaromatic sulfonamide 16
Type:
Small organic molecule
Emp. Form.:
C13H15N3O4S2
Mol. Mass.:
341.406
SMILES:
Nc1ccc(cc1)S(=O)(=O)NCc1ccc(cc1)S(N)(=O)=O
: