Target
Carbonic anhydrase 2
Ligand
BDBM26999
Substrate
Meas. Tech.
ChEMBL_1563413 (CHEMBL3782910)
Ki
9.0±n/a nM
Citation
 Eminoglu, AVullo, DAsik, AÇolak, DNÇanakçi, SBeldüz, AOSupuran, CT Sulfonamide inhibition studies of theß-carbonic anhydrase from the newly discovered bacterium Enterobacter sp. B13. Bioorg Med Chem Lett 26:1821-6 (2016)  
Target
Name:
Carbonic anhydrase 2
Synonyms:
CA-II CAC Carbonate dehydratase II Carbonic anhydrase 2 (CA-II) Carbonic anhydrase C Carbonic anhydrase II (CA-II) Carbonic anhydrase II (hCA II) | Carbonic anhydrase isoenzyme II (hCA II)
Type:
Enzyme
Mol. Mass.:
29250.71
Organism:
Homo sapiens (Human)
Description:
P00918
Residue:
260
  
Inhibitor
Name:
BDBM26999
Synonyms:
4-(1,1-dioxo-1,2-thiazinan-2-yl)benzene-1-sulfonamide Contravul Sulthiame (SLT) | Sulthiame, 2
Type:
Small organic molecule
Emp. Form.:
C10H14N2O4S2
Mol. Mass.:
290.359
SMILES:
NS(=O)(=O)c1ccc(cc1)N1CCCCS1(=O)=O
: