Target
Tyrosine-protein kinase JAK1
Ligand
BDBM50152595
Substrate
Meas. Tech.
ChEMBL_1564733 (CHEMBL3784138)
IC50
0.100000±n/a nM
Citation
 Simov, VDeshmukh, SVDinsmore, CJElwood, FFernandez, RBGarcia, YGibeau, CGunaydin, HJung, JKatz, JDKraybill, BLapointe, BPatel, SBSiu, TSu, HYoung, JR Structure-based design and development of (benz)imidazole pyridones as JAK1-selective kinase inhibitors. Bioorg Med Chem Lett 26:1803-8 (2016)  
Target
Name:
Tyrosine-protein kinase JAK1
Synonyms:
JAK-1 JAK1A JAK1_HUMAN Janus kinase 1 (JAK1) | Janus kinase 1 JAK1
Type:
Protein
Mol. Mass.:
133293.73
Organism:
Homo sapiens (Human)
Description:
P23458
Residue:
1154
  
Inhibitor
Name:
BDBM50152595
Synonyms:
CHEMBL3780091
Type:
Small organic molecule
Emp. Form.:
C18H21N5O
Mol. Mass.:
323.3922
SMILES:
N[C@H]1CC[C@H](CC1)Nc1cc[nH]c(=O)c1-c1nc2ccccc2[nH]1
: