Target
Tubulin beta chain
Ligand
BDBM50152677
Substrate
Meas. Tech.
ChEMBL_1564890 (CHEMBL3784810)
IC50
7160±n/a nM
Citation
 An, WWang, WYu, TZhang, YMiao, ZMeng, TShen, J Discovery of novel 2-phenyl-imidazo[1,2-a]pyridine analogues targeting tubulin polymerization as antiproliferative agents. Eur J Med Chem 112:367-72 (2016)  
Target
Name:
Tubulin beta chain
Synonyms:
Beta-tubulin Tubulin beta chain
Type:
PROTEIN
Mol. Mass.:
49840.26
Organism:
Sus scrofa
Description:
ChEMBL_105107
Residue:
445
  
Inhibitor
Name:
BDBM50152677
Synonyms:
CHEMBL3780715
Type:
Small organic molecule
Emp. Form.:
C20H18N4O2
Mol. Mass.:
346.3825
SMILES:
COc1ccc(CNc2c(nc3cnccn23)-c2ccccc2O)cc1
: