Target
Coagulation factor XI
Ligand
BDBM50063582
Substrate
Meas. Tech.
ChEBML_1563872
Ki
6.7±n/a nM
Citation
 Corte, JRFang, TPinto, DJOrwat, MJRendina, ARLuettgen, JMRossi, KAWei, ARamamurthy, VMyers, JESheriff, SNarayanan, RHarper, TWZheng, JJLi, YXSeiffert, DAWexler, RRQuan, ML Orally bioavailable pyridine and pyrimidine-based Factor XIa inhibitors: Discovery of the methyl N-phenyl carbamate P2 prime group. Bioorg Med Chem 24:2257-72 (2016)  
Target
Name:
Coagulation factor XI
Synonyms:
Coagulation factor XIa Coagulation factor XIa light chain FA11_HUMAN Factor XIa PTA | Plasma thromboplastin antecedent
Type:
Enzyme
Mol. Mass.:
70130.58
Organism:
Homo sapiens (Human)
Description:
P03951
Residue:
625
  
Inhibitor
Name:
BDBM50063582
Synonyms:
CHEMBL3398642
Type:
Small organic molecule
Emp. Form.:
C29H25ClN8O3
Mol. Mass.:
569.014
SMILES:
COC(=O)Nc1ccc(cc1)-c1c[nH]c(n1)[C@H](Cc1ccccc1)NC(=O)\C=C\c1cc(Cl)ccc1-n1cnnn1
: