Target
Coagulation factor VII
Ligand
BDBM50153049
Substrate
Meas. Tech.
ChEBML_1563871
Ki
>12170±n/a nM
Citation
 Corte, JRFang, TPinto, DJOrwat, MJRendina, ARLuettgen, JMRossi, KAWei, ARamamurthy, VMyers, JESheriff, SNarayanan, RHarper, TWZheng, JJLi, YXSeiffert, DAWexler, RRQuan, ML Orally bioavailable pyridine and pyrimidine-based Factor XIa inhibitors: Discovery of the methyl N-phenyl carbamate P2 prime group. Bioorg Med Chem 24:2257-72 (2016)  
Target
Name:
Coagulation factor VII
Synonyms:
Eptacog alfa FA7_HUMAN Factor VIIa (fVIIa) SPCA serum prothrombin conversion accelerator
Type:
Enzyme
Mol. Mass.:
51599.89
Organism:
Homo sapiens (Human)
Description:
Residue:
466
  
Inhibitor
Name:
BDBM50153049
Synonyms:
CHEMBL3781788
Type:
Small organic molecule
Emp. Form.:
C29H34N4O3
Mol. Mass.:
486.6053
SMILES:
COC(=O)Nc1ccc(cc1)-c1ccnc(c1)[C@H](Cc1ccccc1)NC(=O)[C@H]1CC[C@H](CN)CC1
: